1-CO2Me-2-cycloprope-1-ide anion
- Formula: C5H5O2-
- Molecular weight: 97.0925

Gas phase ion energetics data

Data compiled by: John E. Bartmess
Protonation reactions
C5H5O2- + = C5H6O2
By formula: C5H5O2- + H+ = C5H6O2
Quantity | Value | Units | Method | Reference | Comment |
---|---|---|---|---|---|
ΔrH° | 1641. ± 18. | kJ/mol | G+TS | Sachs and Kass, 1994 | gas phase; Between water and fluorobenzene. Site of protonation uncertain. |
Quantity | Value | Units | Method | Reference | Comment |
ΔrG° | 1608. ± 17. | kJ/mol | IMRB | Sachs and Kass, 1994 | gas phase; Between water and fluorobenzene. Site of protonation uncertain. |

References

Sachs and Kass, 1994
Sachs, R.K.; Kass, S.R.,
3-Carbomethoxycyclopropen-3-yl Anion - Formation and Characterization of an Antiaromatic Ion,
J. Am. Chem. Soc., 1994, 116, 2, 783, https://doi.org/10.1021/ja00081a055
. [all data]