(N2O)6..NO anion

Gas phase ion energetics data

Data compiled by: John E. Bartmess

Electron affinity of neutral species

EAneutral (eV) Method Reference Comment
1.040 ± 0.010LPESVelarde, Habteyes, et al., 2007Stated electron affinity is the Vertical Detachment Energy

References

Velarde, Habteyes, et al., 2007
Velarde, L.; Habteyes, T.; Grumbling, E.R.; Pichugin, K.; Sanov, A., Solvent resonance effect on the anisotropy of NO-(N2O)(n) cluster anion photodetachment, J. Chem. Phys., 2007, 127, 8, 084302, https://doi.org/10.1063/1.2766948 . [all data]