silver anion
- Formula: Ag-
- Molecular weight: 107.8687

Gas phase thermochemistry data

Data compiled by: John E. Bartmess
Quantity | Value | Units | Method | Reference | Comment |
---|---|---|---|---|---|
ΔfH°gas | 37.9 ± 2.7 | kcal/mol | Acid | Bilodeau, Scheer, et al., 1998 |

Reaction thermochemistry data

Data compiled by: John E. Bartmess
Individual Reactions
Ag- + = HAg
Quantity | Value | Units | Method | Reference | Comment |
---|---|---|---|---|---|
ΔrH° | 336.1 ± 1.9 | kcal/mol | D-EA | Bilodeau, Scheer, et al., 1998 | gas phase |

Gas phase ion energetics data

Data compiled by: John E. Bartmess
Protonation reactions
Ag- + = HAg
Quantity | Value | Units | Method | Reference | Comment |
---|---|---|---|---|---|
ΔrH° | 336.1 ± 1.9 | kcal/mol | D-EA | Bilodeau, Scheer, et al., 1998 | gas phase |

References

Bilodeau, Scheer, et al., 1998
Bilodeau, R.C.; Scheer, M.; Haugen, H.K.,
Infrared Laser Photodetachment of Transition Metal Negative Ions: Studies on Cr-, Mo-, Cu-, and Ag-,
J. Phys. B: Atom. Mol. Opt. Phys., 1998, 31, 17, 3885-3891, https://doi.org/10.1088/0953-4075/31/17/013
. [all data]