(H2O)3..Cl anion

Gas phase thermochemistry data

Data compiled by: John E. Bartmess

Quantity Value Units Method Reference Comment
Δfgas-1117. ± 7.kJ/molAVGN/AAverage of 6 values; Individual data points

References

No reference data available.