nC10H21O anion

Gas phase ion energetics data

Data compiled by: John E. Bartmess

Electron affinity of neutral species

EAneutral (eV) Method Reference Comment
1.94 ± 0.12D-EAHaas and Harrison, 1993CIDC at 50 eV 1.0 kcal/mol weaker than metastable value.

Protonation reactions

C10H21O- + Hydrogen cation = 1-Decanol

By formula: C10H21O- + H+ = C10H22O

Quantity Value Units Method Reference Comment
Δr1560. ± 8.4kJ/molCIDCHaas and Harrison, 1993gas phase; CIDC at 50 eV 1.0 kcal/mol weaker than metastable value.
Quantity Value Units Method Reference Comment
Δr1533. ± 8.8kJ/molH-TSHaas and Harrison, 1993gas phase; CIDC at 50 eV 1.0 kcal/mol weaker than metastable value.

Reaction thermochemistry data

Data compiled by: John E. Bartmess

Individual Reactions

C10H21O- + Hydrogen cation = 1-Decanol

By formula: C10H21O- + H+ = C10H22O

Quantity Value Units Method Reference Comment
Δr372.9 ± 2.0kcal/molCIDCHaas and Harrison, 1993gas phase; CIDC at 50 eV 1.0 kcal/mol weaker than metastable value.
Quantity Value Units Method Reference Comment
Δr366.3 ± 2.1kcal/molH-TSHaas and Harrison, 1993gas phase; CIDC at 50 eV 1.0 kcal/mol weaker than metastable value.

References

Haas and Harrison, 1993
Haas, M.J.; Harrison, A.G., The Fragmentation of Proton-Bound Cluster Ions and the Gas-Phase Acidities of Alcohols, Int. J. Mass Spectrom. Ion Proc., 1993, 124, 2, 115, https://doi.org/10.1016/0168-1176(93)80003-W . [all data]