cC7H13-O anion
- Formula: C7H13O-
- Molecular weight: 113.1781

Ion clustering data

Data compiled by: John E. Bartmess
Clustering reactions
By formula: H- = C7H13O-
Quantity | Value | Units | Method | Reference | Comment |
---|---|---|---|---|---|
ΔrH° | 154. ± 9.6 | kJ/mol | N/A | Haas and Harrison, 1993 | gas phase; Both metastable and 50 eV collision energy. |

References

Haas and Harrison, 1993
Haas, M.J.; Harrison, A.G.,
The Fragmentation of Proton-Bound Cluster Ions and the Gas-Phase Acidities of Alcohols,
Int. J. Mass Spectrom. Ion Proc., 1993, 124, 2, 115, https://doi.org/10.1016/0168-1176(93)80003-W
. [all data]