Methyl-4-trifluoromethylbenzoate anion
- Formula: C9H7F3O2-
- Molecular weight: 204.1464
- IUPAC Standard InChIKey: BPWIBOSDBBNHBI-UHFFFAOYSA-N
- Chemical structure:
View 3d structure (requires JavaScript / HTML 5) - Permanent link for this species. Use this link for bookmarking this species for future reference.

Gas phase thermochemistry data

Data compiled by: John E. Bartmess
Quantity | Value | Units | Method | Reference | Comment |
---|---|---|---|---|---|
ΔfH°gas | -1022. ± 9.2 | kJ/mol | R-EA | Mishima, Huh, et al., 1995 | ΔGea(343 K)=-17.8 kcal/mol. Reanchored to EA(PhNO2), Kebarle and Chowdhury, 1987. |

References

Mishima, Huh, et al., 1995
Mishima, M.; Huh, C.; Lee, H.W.; Nakamura, H.; Fujio, M.; Tsuno, Y.,
Electron affinities of acetophenones and methyl benzoates. Varying resonance demand of aromatic radical anions,
Tetrahed. Lett., 1995, 36, 13, 2265, https://doi.org/10.1016/0040-4039(95)00267-G
. [all data]
Kebarle and Chowdhury, 1987
Kebarle, P.; Chowdhury, S.,
Electron affinities and electron transfer reactions,
Chem. Rev., 1987, 87, 513. [all data]