3,5-Dichlorobenzaldehyde anion
- Formula: C7H4Cl2O-
- Molecular weight: 175.013
- IUPAC Standard InChIKey: DFCYJFACEJEYRP-UHFFFAOYSA-N
- Chemical structure:
View 3d structure (requires JavaScript / HTML 5) - Permanent link for this species. Use this link for bookmarking this species for future reference.

Gas phase thermochemistry data

Data compiled by: John E. Bartmess
Quantity | Value | Units | Method | Reference | Comment |
---|---|---|---|---|---|
ΔfH°gas | -192. ± 9.2 | kJ/mol | R-EA | Mishima, Huh, et al., 1993 | ΔGea(343 K)=-23.4 kcal/mol. Reanchored to EA(PhNO2), Kebarle and Chowdhury, 1987. |

References

Mishima, Huh, et al., 1993
Mishima, M.; Huh, C.; Nakamura, H.; Fujio, M.; Tsuno, Y.,
Electron Affinities of Benzaldehydes. Substituent Effects on Stabilities of Aromatic Radical Anions.,
Tetrahed. Lett., 1993, 34, 26, 4223, https://doi.org/10.1016/S0040-4039(00)60533-6
. [all data]
Kebarle and Chowdhury, 1987
Kebarle, P.; Chowdhury, S.,
Electron affinities and electron transfer reactions,
Chem. Rev., 1987, 87, 513. [all data]