C6F6..Au radical anion
- Formula: C6AuF6-
- Molecular weight: 383.0217

Ion clustering data

Data compiled by: John E. Bartmess
Clustering reactions
Au- + = C6AuF6-
By formula: Au- + C6F6 = C6AuF6-
Quantity | Value | Units | Method | Reference | Comment |
---|---|---|---|---|---|
ΔrH° | 24.0 ± 4.0 | kcal/mol | N/A | Ho and Dunbar, 1999 | gas phase |

Gas phase ion energetics data

Data compiled by: John E. Bartmess

Electron affinity of neutral species

EAneutral (eV) Method Reference Comment
1.770 ± 0.070LPESSun, Tang, et al., 2013
1.750 ± 0.030LPESNakajima, Taguwa, et al., 1993Vertical Detachment Energy: 1.990±0.048 eV

References

Ho and Dunbar, 1999
Ho, Y.P.; Dunbar, R.C.,
Reactions of Au+ and Au- with benzene and fluorine-substituted benzenes,
Int. J. Mass Spectrom., 1999, 183, 175-184, https://doi.org/10.1016/S1387-3806(98)14245-8
. [all data]