(C6F6)6..C6F6 radical anion

Gas phase ion energetics data

Data compiled by: John E. Bartmess

Electron affinity of neutral species

EAneutral (eV) Method Reference Comment
1.70 ± 0.12LPESNakajima, Taguwa, et al., 1993Vertical Detachment Energy: 2.480±0.061 eV

References

Nakajima, Taguwa, et al., 1993
Nakajima, A.; Taguwa, T.; Hoshino, K.; Sugioka, T.; Naganuma, T.; Ono, F.; Watanabe, K.; Nakao, K., Photoelectron Spectroscopy of (C6F6)n- and (Au-C6F6)- Clusters, Chem. Phys. Lett., 1993, 214, 1, 22, https://doi.org/10.1016/0009-2614(93)85449-X . [all data]