WF4 radical anion

Gas phase thermochemistry data

Data compiled by: John E. Bartmess

Quantity Value Units Method Reference Comment
Δfgas-1280.1kJ/molR-EADe Wall and Neuert, 1977From WF6

References

De Wall and Neuert, 1977
De Wall, R.; Neuert, H., Die Bildung Negativer Ionen bei Elektronenstoss auf WF6, Z. Naturfor., 1977, 32A, 1968. [all data]