CO..Mn(CO)2 anion
- Formula: C3MnO3-
- Molecular weight: 138.9689

Reaction thermochemistry data

Data compiled by: John E. Bartmess
Individual Reactions
C3MnO3 + = C3MnO3-
By formula: C3MnO3 + CO = C3MnO3-
Quantity | Value | Units | Method | Reference | Comment |
---|---|---|---|---|---|
ΔrH° | 119. ± 13. | kJ/mol | CIDT | Sunderlin, Wang, et al., 1993 | gas phase |
C3MnO3- + = C4MnO4-
By formula: C3MnO3- + CO = C4MnO4-
Quantity | Value | Units | Method | Reference | Comment |
---|---|---|---|---|---|
ΔrH° | 172. ± 13. | kJ/mol | CIDT | Sunderlin, Wang, et al., 1993 | gas phase |

Ion clustering data

Data compiled by: John E. Bartmess
Clustering reactions
C3MnO3- + = C4MnO4-
By formula: C3MnO3- + CO = C4MnO4-
Quantity | Value | Units | Method | Reference | Comment |
---|---|---|---|---|---|
ΔrH° | 172. ± 13. | kJ/mol | CIDT | Sunderlin, Wang, et al., 1993 | gas phase |

References

Sunderlin, Wang, et al., 1993
Sunderlin, L.S.; Wang, D.N.; Squires, R.R.,
Bond Strengths in 1st-Row-Metal Carbonyl Anions,
J. Am. Chem. Soc., 1993, 115, 25, 12060, https://doi.org/10.1021/ja00078a051
. [all data]