CO..V(CO)3 anion
- Formula: C4O4V-
- Molecular weight: 162.9824

Reaction thermochemistry data

Data compiled by: John E. Bartmess
Individual Reactions
C3O3V- + = C4O4V-
By formula: C3O3V- + CO = C4O4V-
Quantity | Value | Units | Method | Reference | Comment |
---|---|---|---|---|---|
ΔrH° | 169. ± 24. | kJ/mol | CIDT | Sunderlin, Wang, et al., 1993 | gas phase |
C4O4V- + = C5O5V-
By formula: C4O4V- + CO = C5O5V-
Quantity | Value | Units | Method | Reference | Comment |
---|---|---|---|---|---|
ΔrH° | 130. ± 13. | kJ/mol | CIDT | Sunderlin, Wang, et al., 1993 | gas phase |

Ion clustering data

Data compiled by: John E. Bartmess
Clustering reactions
C3O3V- + = C4O4V-
By formula: C3O3V- + CO = C4O4V-
Quantity | Value | Units | Method | Reference | Comment |
---|---|---|---|---|---|
ΔrH° | 169. ± 24. | kJ/mol | CIDT | Sunderlin, Wang, et al., 1993 | gas phase |
C4O4V- + = C5O5V-
By formula: C4O4V- + CO = C5O5V-
Quantity | Value | Units | Method | Reference | Comment |
---|---|---|---|---|---|
ΔrH° | 130. ± 13. | kJ/mol | CIDT | Sunderlin, Wang, et al., 1993 | gas phase |

Gas phase thermochemistry data

Data compiled by: John E. Bartmess
Quantity | Value | Units | Method | Reference | Comment |
---|---|---|---|---|---|
ΔfH°gas | -129.04 | kcal/mol | Ther | Sunderlin, Wang, et al., 1993 |

References

Sunderlin, Wang, et al., 1993
Sunderlin, L.S.; Wang, D.N.; Squires, R.R.,
Bond Strengths in 1st-Row-Metal Carbonyl Anions,
J. Am. Chem. Soc., 1993, 115, 25, 12060, https://doi.org/10.1021/ja00078a051
. [all data]