CO..V(CO)2 anion
- Formula: C3O3V-
- Molecular weight: 134.9723

Reaction thermochemistry data

Data compiled by: John E. Bartmess
Individual Reactions
C3O3V + = C3O3V-
By formula: C3O3V + CO = C3O3V-
Quantity | Value | Units | Method | Reference | Comment |
---|---|---|---|---|---|
ΔrH° | 150. ± 18. | kJ/mol | CIDT | Sunderlin, Wang, et al., 1993 | gas phase |
C3O3V- + = C4O4V-
By formula: C3O3V- + CO = C4O4V-
Quantity | Value | Units | Method | Reference | Comment |
---|---|---|---|---|---|
ΔrH° | 169. ± 24. | kJ/mol | CIDT | Sunderlin, Wang, et al., 1993 | gas phase |

Ion clustering data

Data compiled by: John E. Bartmess
Clustering reactions
C3O3V- + = C4O4V-
By formula: C3O3V- + CO = C4O4V-
Quantity | Value | Units | Method | Reference | Comment |
---|---|---|---|---|---|
ΔrH° | 169. ± 24. | kJ/mol | CIDT | Sunderlin, Wang, et al., 1993 | gas phase |

References

Sunderlin, Wang, et al., 1993
Sunderlin, L.S.; Wang, D.N.; Squires, R.R.,
Bond Strengths in 1st-Row-Metal Carbonyl Anions,
J. Am. Chem. Soc., 1993, 115, 25, 12060, https://doi.org/10.1021/ja00078a051
. [all data]