H2O..{SO2}4..SO2 radical anion
- Formula: H2O11S5-
- Molecular weight: 338.335

Gas phase thermochemistry data

Data compiled by: John E. Bartmess
Quantity | Value | Units | Method | Reference | Comment |
---|---|---|---|---|---|
ΔfH°gas | -2047.8 ± 2.8 | kJ/mol | Ther | Vacher, Leduc, et al., 1994 |

References

Vacher, Leduc, et al., 1994
Vacher, J.R.; Leduc, E.; Fitaire, M.,
Stabilities of Anionic Mixed Clusters of Sulfur Dioxide and Water,
Int. J. Mass Spectrom. Ion Proc., 1994, 135, 2-3, 139, https://doi.org/10.1016/0168-1176(94)03985-2
. [all data]