(SO2)4..SO2 radical anion

Gas phase ion energetics data

Data compiled by: John E. Bartmess

Electron affinity of neutral species

EAneutral (eV) Method Reference Comment
3.850 ± 0.020LPESTsukuda, Hirose, et al., 1997Stated electron affinity is the Vertical Detachment Energy

References

Tsukuda, Hirose, et al., 1997
Tsukuda, T.; Hirose, T.; Nagata, T., Electronic Structures of (SO2)n- as Studied by Photoelectron Spectroscopy, Int. J. Mass Spectrom. Ion Proc., 1997, 171, 1-3, 273, https://doi.org/10.1016/S0168-1176(97)00240-1 . [all data]