2,4-diMe-benzoate anion
- Formula: C9H9O2-
- Molecular weight: 149.1671

Gas phase ion energetics data

Data compiled by: John E. Bartmess
Electron affinity of neutral species
EAneutral (eV) | Method | Reference | Comment |
---|---|---|---|
3.76 ± 0.16 | D-EA | Decouzon, Ertl, et al., 1993 | relative to benzoate at 333.0 kcal/mol |
Protonation reactions
By formula: C9H9O2- + H+ = C9H10O2
Quantity | Value | Units | Method | Reference | Comment |
---|---|---|---|---|---|
ΔrH° | 339.9 ± 2.1 | kcal/mol | G+TS | Decouzon, Ertl, et al., 1993 | gas phase; relative to benzoate at 333.0 kcal/mol |
Quantity | Value | Units | Method | Reference | Comment |
ΔrG° | 332.9 ± 2.0 | kcal/mol | IMRE | Decouzon, Ertl, et al., 1993 | gas phase; relative to benzoate at 333.0 kcal/mol |

Reaction thermochemistry data

Data compiled by: John E. Bartmess

Individual Reactions

C9H9O2- + Hydrogen cation = Benzoic acid, 2,4-dimethyl-

By formula: C9H9O2- + H+ = C9H10O2

Quantity Value Units Method Reference Comment
Δr339.9 ± 2.1kcal/molG+TSDecouzon, Ertl, et al., 1993gas phase; relative to benzoate at 333.0 kcal/mol
Quantity Value Units Method Reference Comment
Δr332.9 ± 2.0kcal/molIMREDecouzon, Ertl, et al., 1993gas phase; relative to benzoate at 333.0 kcal/mol

References

Decouzon, Ertl, et al., 1993
Decouzon, M.; Ertl, P.; Exner, O.; Gal, J.F.; Maria, P.C.,
Concepts of Sterically Hindered Resonance and Buttressing Effect - Gas-Phase Acidities of Methyl-Substituted Benzoic Acids and Basicities of,
J. Am. Chem. Soc., 1993, 115, 25, 12071, https://doi.org/10.1021/ja00078a052
. [all data]