Uranium hexafluoride anion

Gas phase thermochemistry data

Data compiled by: John E. Bartmess

Quantity Value Units Method Reference Comment
Δfgas-2624. ± 21.kJ/molTherBorshchevskii, Boltalina, et al., 1988value altered from reference due to conversion from electron convention to ion convention
Δfgas-2674. ± 25.kJ/molTDEqPyatenko, Guasarov, et al., 1984Critical review; value altered from reference due to conversion from electron convention to ion convention
Δfgas-2643. ± 30.kJ/molTDEqSkokan, Sorokin, et al., 1983Fluoride Affinity: 13.1±2 kcal > UF4; value altered from reference due to conversion from electron convention to ion convention
Δfgas-2720. ± 42.kJ/molLattMallouk, Rosenthal, et al., 1984

References

Borshchevskii, Boltalina, et al., 1988
Borshchevskii, A.Ya.; Boltalina, O.V.; Sorokin, I.D.; Sidorov, L.N., Thermochemical Quantities for Gas Phase Iron, Uranium, and Molybdenum Fluorides, and Their Negative Ions., J. Chem. Thermodyn., 1988, 20, 5, 523, https://doi.org/10.1016/0021-9614(88)90080-8 . [all data]

Pyatenko, Guasarov, et al., 1984
Pyatenko, A.T.; Guasarov, A.V.; Gorokhov, L.N., Thermochemistry of Negative Ions in the U-F System, Russ. J. Phys. Chem., 1984, 58, 1. [all data]

Skokan, Sorokin, et al., 1983
Skokan, E.V.; Sorokin, I.D.; Nikitin, M.I.; Chilingarov, N.S.; Sidorov, L.N., The electron affinity of UF6, Russ. J. Phys. Chem., 1983, 57, 1745. [all data]

Mallouk, Rosenthal, et al., 1984
Mallouk, T.E.; Rosenthal, G.L.; Muller, G.; Brusasco, R.; Bartlett, N., Fluoride ion affinities of GeF4 and BF4 from thermodynamic and structural data for (SF2)2GeF6, ClO2GeF5, and ClO2BF4, Inorg. Chem., 1984, 23, 3167. [all data]