HCðCS anion
- Formula: C2HS-
- Molecular weight: 57.095

Gas phase ion energetics data

Data compiled by: John E. Bartmess
Protonation reactions
By formula: C2HS- + H+ = C2H2S
Quantity | Value | Units | Method | Reference | Comment |
---|---|---|---|---|---|
ΔrH° | 1469. ± 17. | kJ/mol | G+TS | Robinson, Davico, et al., 1994 | gas phase; Data listed as M.R. Krempp, personal communication, 1994 |
Quantity | Value | Units | Method | Reference | Comment |
ΔrG° | 1436. ± 17. | kJ/mol | IMRB | Robinson, Davico, et al., 1994 | gas phase; Data listed as M.R. Krempp, personal communication, 1994 |

References

Robinson, Davico, et al., 1994
Robinson, M.S.; Davico, G.E.; Bierbaum, V.M.; Depuy, C.H.,
The gas phase ion/molecule chemistry of the carbon-13 labeled ketenyl and methyl ketenyl anions with CS2, COS, and CO2,
Int. J. Mass Spectrom. Ion Proc., 1994, 137, 107, https://doi.org/10.1016/0168-1176(94)04030-3
. [all data]