(H2O)5..O3SOOSO3 dianion

Ion clustering data

Data compiled by: John E. Bartmess

Clustering reactions

H8O12S2-2 + 5Water = H10O13S2-2

By formula: H8O12S2-2 + 5H2O = H10O13S2-2

Quantity Value Units Method Reference Comment
Δr24.7 ± 1.3kJ/molTDAsBlades, Klassen, et al., 1995gas phase

H10O13S2-2 + 6Water = H12O14S2-2

By formula: H10O13S2-2 + 6H2O = H12O14S2-2

Quantity Value Units Method Reference Comment
Δr22.6 ± 1.3kJ/molTDAsBlades, Klassen, et al., 1995gas phase

Reaction thermochemistry data

Data compiled by: John E. Bartmess

Individual Reactions

H8O12S2-2 + 5Water = H10O13S2-2

By formula: H8O12S2-2 + 5H2O = H10O13S2-2

Quantity Value Units Method Reference Comment
Δr5.90 ± 0.30kcal/molTDAsBlades, Klassen, et al., 1995gas phase

H10O13S2-2 + 6Water = H12O14S2-2

By formula: H10O13S2-2 + 6H2O = H12O14S2-2

Quantity Value Units Method Reference Comment
Δr5.40 ± 0.30kcal/molTDAsBlades, Klassen, et al., 1995gas phase

References

Blades, Klassen, et al., 1995
Blades, A.T.; Klassen, J.S.; Kebarle, P., Free Energies of Hydration in the Gas Phase on the Anions of Some Oxo Acids of C, N, S, P, Cl and I, J. Am. Chem. Soc., 1995, 117, 42, 10563, https://doi.org/10.1021/ja00147a019 . [all data]