(H2O)5..O3SCH2CH2SO3 dianion
- Formula: C2H14O11S2-2
- Molecular weight: 278.257

Reaction thermochemistry data

Data compiled by: John E. Bartmess
Individual Reactions
C2H12O10S2-2 + 5 = C2H14O11S2-2
By formula: C2H12O10S2-2 + 5H2O = C2H14O11S2-2
Quantity | Value | Units | Method | Reference | Comment |
---|---|---|---|---|---|
ΔrG° | 24.7 ± 1.3 | kJ/mol | TDAs | Blades, Klassen, et al., 1995 | gas phase |
C2H14O11S2-2 + 6 = C2H16O12S2-2
By formula: C2H14O11S2-2 + 6H2O = C2H16O12S2-2
Quantity | Value | Units | Method | Reference | Comment |
---|---|---|---|---|---|
ΔrG° | 22.2 ± 1.3 | kJ/mol | TDAs | Blades, Klassen, et al., 1995 | gas phase |

Ion clustering data

Data compiled by: John E. Bartmess
Clustering reactions
C2H12O10S2-2 + 5 = C2H14O11S2-2
By formula: C2H12O10S2-2 + 5H2O = C2H14O11S2-2
Quantity | Value | Units | Method | Reference | Comment |
---|---|---|---|---|---|
ΔrG° | 24.7 ± 1.3 | kJ/mol | TDAs | Blades, Klassen, et al., 1995 | gas phase |
C2H14O11S2-2 + 6 = C2H16O12S2-2
By formula: C2H14O11S2-2 + 6H2O = C2H16O12S2-2
Quantity | Value | Units | Method | Reference | Comment |
---|---|---|---|---|---|
ΔrG° | 22.2 ± 1.3 | kJ/mol | TDAs | Blades, Klassen, et al., 1995 | gas phase |

References

Blades, Klassen, et al., 1995
Blades, A.T.; Klassen, J.S.; Kebarle, P.,
Free Energies of Hydration in the Gas Phase on the Anions of Some Oxo Acids of C, N, S, P, Cl and I,
J. Am. Chem. Soc., 1995, 117, 42, 10563, https://doi.org/10.1021/ja00147a019
. [all data]