(H2O)8..O3SSO3 dianion

Reaction thermochemistry data

Data compiled by: John E. Bartmess

Individual Reactions

H14O13S2-2 + 8Water = H16O14S2-2

By formula: H14O13S2-2 + 8H2O = H16O14S2-2

Quantity Value Units Method Reference Comment
Δr21.3 ± 1.3kJ/molTDAsBlades, Klassen, et al., 1995gas phase

Ion clustering data

Data compiled by: John E. Bartmess

Clustering reactions

H14O13S2-2 + 8Water = H16O14S2-2

By formula: H14O13S2-2 + 8H2O = H16O14S2-2

Quantity Value Units Method Reference Comment
Δr21.3 ± 1.3kJ/molTDAsBlades, Klassen, et al., 1995gas phase

References

Blades, Klassen, et al., 1995
Blades, A.T.; Klassen, J.S.; Kebarle, P., Free Energies of Hydration in the Gas Phase on the Anions of Some Oxo Acids of C, N, S, P, Cl and I, J. Am. Chem. Soc., 1995, 117, 42, 10563, https://doi.org/10.1021/ja00147a019 . [all data]