(H2O)8..S2O3 dianion
- Formula: H16O11S2-2
- Molecular weight: 256.252

Ion clustering data

Data compiled by: John E. Bartmess
Clustering reactions
H14O10S2-2 + 8 = H16O11S2-2
By formula: H14O10S2-2 + 8H2O = H16O11S2-2
Quantity | Value | Units | Method | Reference | Comment |
---|---|---|---|---|---|
ΔrG° | 5.90 ± 0.30 | kcal/mol | TDAs | Blades, Klassen, et al., 1995 | gas phase |
H16O11S2-2 + 9 = H18O12S2-2
By formula: H16O11S2-2 + 9H2O = H18O12S2-2
Quantity | Value | Units | Method | Reference | Comment |
---|---|---|---|---|---|
ΔrG° | 5.30 ± 0.30 | kcal/mol | TDAs | Blades, Klassen, et al., 1995 | gas phase |

References

Blades, Klassen, et al., 1995
Blades, A.T.; Klassen, J.S.; Kebarle, P.,
Free Energies of Hydration in the Gas Phase on the Anions of Some Oxo Acids of C, N, S, P, Cl and I,
J. Am. Chem. Soc., 1995, 117, 42, 10563, https://doi.org/10.1021/ja00147a019
. [all data]