(H2O)9..SeO4 dianion
- Formula: H18O13Se-2
- Molecular weight: 305.10

Reaction thermochemistry data

Data compiled by: John E. Bartmess
Individual Reactions
H16O12Se-2 + 9 = H18O13Se-2
By formula: H16O12Se-2 + 9H2O = H18O13Se-2
Quantity | Value | Units | Method | Reference | Comment |
---|---|---|---|---|---|
ΔrG° | 23.4 ± 1.3 | kJ/mol | TDAs | Blades, Klassen, et al., 1995 | gas phase |

Ion clustering data

Data compiled by: John E. Bartmess
Clustering reactions
H16O12Se-2 + 9 = H18O13Se-2
By formula: H16O12Se-2 + 9H2O = H18O13Se-2
Quantity | Value | Units | Method | Reference | Comment |
---|---|---|---|---|---|
ΔrG° | 23.4 ± 1.3 | kJ/mol | TDAs | Blades, Klassen, et al., 1995 | gas phase |

References

Blades, Klassen, et al., 1995
Blades, A.T.; Klassen, J.S.; Kebarle, P.,
Free Energies of Hydration in the Gas Phase on the Anions of Some Oxo Acids of C, N, S, P, Cl and I,
J. Am. Chem. Soc., 1995, 117, 42, 10563, https://doi.org/10.1021/ja00147a019
. [all data]