(H2O)11..SO4 dianion
- Formula: H22O15S-2
- Molecular weight: 294.232

Gas phase ion energetics data

Data compiled by: John E. Bartmess
Electron affinity of neutral species
EAneutral (eV) | Method | Reference | Comment |
---|---|---|---|
3.12 ± 0.10 | LPES | Wang, Nicholas, et al., 2000 | Vertical Detachment Energy: 3.60±0.10 eV. |

Ion clustering data

Data compiled by: John E. Bartmess
Clustering reactions
H20O14S-2 + 11 = H22O15S-2
By formula: H20O14S-2 + 11H2O = H22O15S-2
Quantity | Value | Units | Method | Reference | Comment |
---|---|---|---|---|---|
ΔrH° | 10.9 ± 2.0 | kcal/mol | TDAs | Blades and Kebarle, 2005 | gas phase |
Quantity | Value | Units | Method | Reference | Comment |
ΔrG° | 5.3 ± 2.0 | kcal/mol | TDAs | Blades and Kebarle, 2005 | gas phase |

References

Wang, Nicholas, et al., 2000
Wang, X.B.; Nicholas, J.B.; Wang, L.S.,
Electronic instability of isolated SO42- and its solvation stabilization,
J. Chem. Phys., 2000, 113, 24, 10837-10840, https://doi.org/10.1063/1.1333703
. [all data]
Blades and Kebarle, 2005
Blades, A.T.; Kebarle, P.,
Sequential hydration energies of the sulfate ion, from determinations of the equilibrium constants for the gas-phase reactions: SO4(H2O)(n)(2-) = SO4(H2O)(n-1)(2-)+H2O,
J. Phys. Chem. A, 2005, 109, 37, 8293-8298, https://doi.org/10.1021/jp0540353
. [all data]