(H2O)8..SO4 dianion
- Formula: H16O12S-2
- Molecular weight: 240.186

Gas phase ion energetics data

Data compiled by: John E. Bartmess
Electron affinity of neutral species
EAneutral (eV) | Method | Reference | Comment |
---|---|---|---|
2.43 ± 0.10 | LPES | Wang, Nicholas, et al., 2000 | Vertical Detachment Energy: 2.84±0.10 eV. |

Ion clustering data

Data compiled by: John E. Bartmess
Clustering reactions
H14O11S-2 + 8 = H16O12S-2
By formula: H14O11S-2 + 8H2O = H16O12S-2
Quantity | Value | Units | Method | Reference | Comment |
---|---|---|---|---|---|
ΔrH° | 12.4 ± 2.0 | kcal/mol | TDAs | Blades and Kebarle, 2005 | gas phase |
Quantity | Value | Units | Method | Reference | Comment |
ΔrG° | 6.8 ± 2.0 | kcal/mol | TDAs | Blades and Kebarle, 2005 | gas phase |
ΔrG° | 6.70 ± 0.30 | kcal/mol | TDAs | Blades, Klassen, et al., 1995 | gas phase |
H16O12S-2 + 9 = H18O13S-2
By formula: H16O12S-2 + 9H2O = H18O13S-2
Quantity | Value | Units | Method | Reference | Comment |
---|---|---|---|---|---|
ΔrH° | 11.8 ± 2.0 | kcal/mol | TDAs | Blades and Kebarle, 2005 | gas phase |
Quantity | Value | Units | Method | Reference | Comment |
ΔrG° | 6.1 ± 2.0 | kcal/mol | TDAs | Blades and Kebarle, 2005 | gas phase |
ΔrG° | 6.00 ± 0.30 | kcal/mol | TDAs | Blades, Klassen, et al., 1995 | gas phase |

Reaction thermochemistry data

Data compiled by: John E. Bartmess

Individual Reactions

H14O11S-2 + 8Water = H16O12S-2

By formula: H14O11S-2 + 8H2O = H16O12S-2

Quantity Value Units Method Reference Comment
Δr51.9 ± 8.4kJ/molTDAsBlades and Kebarle, 2005gas phase
Quantity Value Units Method Reference Comment
Δr28. ± 8.4kJ/molTDAsBlades and Kebarle, 2005gas phase
Δr28.0 ± 1.3kJ/molTDAsBlades, Klassen, et al., 1995gas phase

H16O12S-2 + 9Water = H18O13S-2

By formula: H16O12S-2 + 9H2O = H18O13S-2

Quantity Value Units Method Reference Comment
Δr49.4 ± 8.4kJ/molTDAsBlades and Kebarle, 2005gas phase
Quantity Value Units Method Reference Comment
Δr26. ± 8.4kJ/molTDAsBlades and Kebarle, 2005gas phase
Δr25.1 ± 1.3kJ/molTDAsBlades, Klassen, et al., 1995gas phase

References

Wang, Nicholas, et al., 2000
Wang, X.B.; Nicholas, J.B.; Wang, L.S.,
Electronic instability of isolated SO42- and its solvation stabilization,
J. Chem. Phys., 2000, 113, 24, 10837-10840, https://doi.org/10.1063/1.1333703
. [all data]
Blades and Kebarle, 2005
Blades, A.T.; Kebarle, P.,
Sequential hydration energies of the sulfate ion, from determinations of the equilibrium constants for the gas-phase reactions: SO4(H2O)(n)(2-) = SO4(H2O)(n-1)(2-)+H2O,
J. Phys. Chem. A, 2005, 109, 37, 8293-8298, https://doi.org/10.1021/jp0540353
. [all data]
Blades, Klassen, et al., 1995
Blades, A.T.; Klassen, J.S.; Kebarle, P.,
Free Energies of Hydration in the Gas Phase on the Anions of Some Oxo Acids of C, N, S, P, Cl and I,
J. Am. Chem. Soc., 1995, 117, 42, 10563, https://doi.org/10.1021/ja00147a019
. [all data]