(H2O)5..1,4-O2C-C6H4-CO2 dianion

Reaction thermochemistry data

Data compiled by: John E. Bartmess

Individual Reactions

C8H12O8-2 + 5Water = C8H14O9-2

By formula: C8H12O8-2 + 5H2O = C8H14O9-2

Quantity Value Units Method Reference Comment
Δr26.4 ± 1.3kJ/molTDAsBlades, Klassen, et al., 1995gas phase

C8H14O9-2 + 6Water = C8H16O10-2

By formula: C8H14O9-2 + 6H2O = C8H16O10-2

Quantity Value Units Method Reference Comment
Δr24.7 ± 1.3kJ/molTDAsBlades, Klassen, et al., 1995gas phase

References

Blades, Klassen, et al., 1995
Blades, A.T.; Klassen, J.S.; Kebarle, P., Free Energies of Hydration in the Gas Phase on the Anions of Some Oxo Acids of C, N, S, P, Cl and I, J. Am. Chem. Soc., 1995, 117, 42, 10563, https://doi.org/10.1021/ja00147a019 . [all data]