(H2O)5..O2C(CH2)8CO2 dianion

Ion clustering data

Data compiled by: John E. Bartmess

Clustering reactions

C10H24O8-2 + 5Water = C10H26O9-2

By formula: C10H24O8-2 + 5H2O = C10H26O9-2

Quantity Value Units Method Reference Comment
Δr24.3 ± 1.3kJ/molTDAsBlades, Klassen, et al., 1995gas phase

C10H26O9-2 + 6Water = C10H28O10-2

By formula: C10H26O9-2 + 6H2O = C10H28O10-2

Quantity Value Units Method Reference Comment
Δr21.3 ± 1.3kJ/molTDAsBlades, Klassen, et al., 1995gas phase

Reaction thermochemistry data

Data compiled by: John E. Bartmess

Individual Reactions

C10H24O8-2 + 5Water = C10H26O9-2

By formula: C10H24O8-2 + 5H2O = C10H26O9-2

Quantity Value Units Method Reference Comment
Δr5.80 ± 0.30kcal/molTDAsBlades, Klassen, et al., 1995gas phase

C10H26O9-2 + 6Water = C10H28O10-2

By formula: C10H26O9-2 + 6H2O = C10H28O10-2

Quantity Value Units Method Reference Comment
Δr5.10 ± 0.30kcal/molTDAsBlades, Klassen, et al., 1995gas phase

References

Blades, Klassen, et al., 1995
Blades, A.T.; Klassen, J.S.; Kebarle, P., Free Energies of Hydration in the Gas Phase on the Anions of Some Oxo Acids of C, N, S, P, Cl and I, J. Am. Chem. Soc., 1995, 117, 42, 10563, https://doi.org/10.1021/ja00147a019 . [all data]