(H2O)3..(HO)2PO2 anion
- Formula: H8O7P-
- Molecular weight: 151.0336

Gas phase thermochemistry data

Data compiled by: John E. Bartmess
Quantity | Value | Units | Method | Reference | Comment |
---|---|---|---|---|---|
ΔfH°gas | -887.01 | kJ/mol | Ther | Blades, Ho, et al., 1996 | |
ΔfH°gas | -884.92 | kJ/mol | Ther | Blades, Klassen, et al., 1995 | T: 293 K. ΔSaff approx. 24 cal/mol-K |

Ion clustering data

Data compiled by: John E. Bartmess
Clustering reactions
H6O6P- + 3 = H8O7P-
By formula: H6O6P- + 3H2O = H8O7P-
Quantity | Value | Units | Method | Reference | Comment |
---|---|---|---|---|---|
ΔrH° | 51.5 ± 4.2 | kJ/mol | TDAs | Blades, Ho, et al., 1996 | gas phase |
ΔrH° | 49.4 ± 6.3 | kJ/mol | TDAs | Blades, Klassen, et al., 1995 | gas phase; T: 293 K. ΔSaff approx. 24 cal/mol-K |
Quantity | Value | Units | Method | Reference | Comment |
ΔrG° | 26. ± 4.2 | kJ/mol | TDAs | Blades, Ho, et al., 1996 | gas phase |
ΔrG° | 20.1 ± 1.3 | kJ/mol | TDAs | Blades, Klassen, et al., 1995 | gas phase; T: 293 K. ΔSaff approx. 24 cal/mol-K |

Reaction thermochemistry data

Data compiled by: John E. Bartmess

Individual Reactions

H6O6P- + 3Water = H8O7P-

By formula: H6O6P- + 3H2O = H8O7P-

Quantity Value Units Method Reference Comment
Δr12.3 ± 1.0kcal/molTDAsBlades, Ho, et al., 1996gas phase
Δr11.8 ± 1.5kcal/molTDAsBlades, Klassen, et al., 1995gas phase; T: 293 K. ΔSaff approx. 24 cal/mol-K
Quantity Value Units Method Reference Comment
Δr6.1 ± 1.0kcal/molTDAsBlades, Ho, et al., 1996gas phase
Δr4.80 ± 0.30kcal/molTDAsBlades, Klassen, et al., 1995gas phase; T: 293 K. ΔSaff approx. 24 cal/mol-K

References

Blades, Ho, et al., 1996
Blades, A.T.; Ho, Y.; Kebarle, P.,
Free Energies of Hydration in the Gas Phase of Some Phosphate Singly and Doubly Charged Anions: orthophosphate, diphosphate, Ribose-5-phosphate, Adenosine-5'-phosphate and Adenosine-5'-Dipho,
J. Phys. Chem., 1996, 100, 6, 2443, https://doi.org/10.1021/jp952032s
. [all data]
Blades, Klassen, et al., 1995
Blades, A.T.; Klassen, J.S.; Kebarle, P.,
Free Energies of Hydration in the Gas Phase on the Anions of Some Oxo Acids of C, N, S, P, Cl and I,
J. Am. Chem. Soc., 1995, 117, 42, 10563, https://doi.org/10.1021/ja00147a019
. [all data]