(H2O)2..HO2CCH2CH2CO2 anion

Ion clustering data

Data compiled by: John E. Bartmess

Clustering reactions

C4H7O5- + 2Water = C4H9O6-

By formula: C4H7O5- + 2H2O = C4H9O6-

Quantity Value Units Method Reference Comment
Δr16.7 ± 1.3kJ/molTDAsBlades, Klassen, et al., 1995gas phase

Reaction thermochemistry data

Data compiled by: John E. Bartmess

Individual Reactions

C4H7O5- + 2Water = C4H9O6-

By formula: C4H7O5- + 2H2O = C4H9O6-

Quantity Value Units Method Reference Comment
Δr4.00 ± 0.30kcal/molTDAsBlades, Klassen, et al., 1995gas phase

References

Blades, Klassen, et al., 1995
Blades, A.T.; Klassen, J.S.; Kebarle, P., Free Energies of Hydration in the Gas Phase on the Anions of Some Oxo Acids of C, N, S, P, Cl and I, J. Am. Chem. Soc., 1995, 117, 42, 10563, https://doi.org/10.1021/ja00147a019 . [all data]