H2O..tr-HO2CCH=CHCO2 anion

Ion clustering data

Data compiled by: John E. Bartmess

Clustering reactions

C4H5O5- + 2Water = C4H7O6-

By formula: C4H5O5- + 2H2O = C4H7O6-

Quantity Value Units Method Reference Comment
Δr21.8 ± 1.3kJ/molTDAsBlades, Klassen, et al., 1995gas phase

Reaction thermochemistry data

Data compiled by: John E. Bartmess

Individual Reactions

CAS Reg. No. 18610-40-7 + Water = C4H5O5-

By formula: CAS Reg. No. 18610-40-7 + H2O = C4H5O5-

Quantity Value Units Method Reference Comment
Δr14.3 ± 1.5kcal/molTDAsBlades, Klassen, et al., 1995gas phase; T: 293 K. ΔSaff approx. 24 cal/mol-K
Quantity Value Units Method Reference Comment
Δr7.30 ± 0.30kcal/molTDAsBlades, Klassen, et al., 1995gas phase; T: 293 K. ΔSaff approx. 24 cal/mol-K

C4H5O5- + 2Water = C4H7O6-

By formula: C4H5O5- + 2H2O = C4H7O6-

Quantity Value Units Method Reference Comment
Δr5.20 ± 0.30kcal/molTDAsBlades, Klassen, et al., 1995gas phase

References

Blades, Klassen, et al., 1995
Blades, A.T.; Klassen, J.S.; Kebarle, P., Free Energies of Hydration in the Gas Phase on the Anions of Some Oxo Acids of C, N, S, P, Cl and I, J. Am. Chem. Soc., 1995, 117, 42, 10563, https://doi.org/10.1021/ja00147a019 . [all data]