H2O..HO2C(CH2)4CO2 anion
- Formula: C6H11O5-
- Molecular weight: 163.1491

Reaction thermochemistry data

Data compiled by: John E. Bartmess
Individual Reactions
C6H9O4-2 + = C6H11O5-
By formula: C6H9O4-2 + H2O = C6H11O5-
Quantity | Value | Units | Method | Reference | Comment |
---|---|---|---|---|---|
ΔrG° | 23.8 ± 1.3 | kJ/mol | TDAs | Blades, Klassen, et al., 1995 | gas phase |
C6H11O5- + 2 = C6H13O6-
By formula: C6H11O5- + 2H2O = C6H13O6-
Quantity | Value | Units | Method | Reference | Comment |
---|---|---|---|---|---|
ΔrG° | 18.4 ± 1.3 | kJ/mol | TDAs | Blades, Klassen, et al., 1995 | gas phase |

Ion clustering data

Data compiled by: John E. Bartmess
Clustering reactions
C6H9O4-2 + = C6H11O5-
By formula: C6H9O4-2 + H2O = C6H11O5-
Quantity | Value | Units | Method | Reference | Comment |
---|---|---|---|---|---|
ΔrG° | 23.8 ± 1.3 | kJ/mol | TDAs | Blades, Klassen, et al., 1995 | gas phase |
C6H11O5- + 2 = C6H13O6-
By formula: C6H11O5- + 2H2O = C6H13O6-
Quantity | Value | Units | Method | Reference | Comment |
---|---|---|---|---|---|
ΔrG° | 18.4 ± 1.3 | kJ/mol | TDAs | Blades, Klassen, et al., 1995 | gas phase |

References

Blades, Klassen, et al., 1995
Blades, A.T.; Klassen, J.S.; Kebarle, P.,
Free Energies of Hydration in the Gas Phase on the Anions of Some Oxo Acids of C, N, S, P, Cl and I,
J. Am. Chem. Soc., 1995, 117, 42, 10563, https://doi.org/10.1021/ja00147a019
. [all data]