H2O..(HO)2PO2 anion
- Formula: H4O5P-
- Molecular weight: 115.0031

Gas phase thermochemistry data

Data compiled by: John E. Bartmess
Quantity | Value | Units | Method | Reference | Comment |
---|---|---|---|---|---|
ΔfH°gas | -300.4 | kJ/mol | Ther | Blades, Ho, et al., 1996 |

References

Blades, Ho, et al., 1996
Blades, A.T.; Ho, Y.; Kebarle, P.,
Hydration in the Gas Phase of the Orthophosphate Anion (HO)2PO2-, and the Conversion of the Orthophosphate anion to the Metaphosphate, PO3-, Ion,
J. Am. Chem. Soc., 1996, 118, 1, 196, https://doi.org/10.1021/ja952169w
. [all data]