TeF4 radical anion
- Formula: F4Te-
- Molecular weight: 203.59

Gas phase thermochemistry data

Data compiled by: John E. Bartmess
Quantity | Value | Units | Method | Reference | Comment |
---|---|---|---|---|---|
ΔfH°gas | -214. ± 10. | kcal/mol | EIAE | Brion, 1969 |

References

Brion, 1969
Brion, C.E.,
Negative Ion Formation in the Hexafluorides of Sulphur, Selenium, and Tellurium,
Int. J. Mass Spectrom. Ion Phys., 1969, 3, 3-4, 197, https://doi.org/10.1016/0020-7381(69)85003-5
. [all data]