CH2=CHCH=CH anion

Gas phase ion energetics data

Data compiled by: John E. Bartmess

Protonation reactions

C4H5- + Hydrogen cation = 1,3-Butadiene

By formula: C4H5- + H+ = C4H6

Quantity Value Units Method Reference Comment
Δr1672. ± 13.kJ/molG+TSDevisser, Dekoning, et al., 1995gas phase
Quantity Value Units Method Reference Comment
Δr1637. ± 13.kJ/molIMRBDevisser, Dekoning, et al., 1995gas phase

Reaction thermochemistry data

Data compiled by: John E. Bartmess

Individual Reactions

C4H5- + Hydrogen cation = 1,3-Butadiene

By formula: C4H5- + H+ = C4H6

Quantity Value Units Method Reference Comment
Δr399.5 ± 3.1kcal/molG+TSDevisser, Dekoning, et al., 1995gas phase
Quantity Value Units Method Reference Comment
Δr391.3 ± 3.0kcal/molIMRBDevisser, Dekoning, et al., 1995gas phase

References

Devisser, Dekoning, et al., 1995
Devisser, S.P.; Dekoning, L.J.; Vanderhart, W.J.; Nibbering, N.M.M., Chemical properties of butadienyl anions in the gas-phase, Recl. Trav. Chim. Pays-Bas, 1995, 114, 6, 267, https://doi.org/10.1002/recl.19951140603 . [all data]