HONNO anion
- Formula: HN2O2-
- Molecular weight: 61.0207

Gas phase thermochemistry data

Data compiled by: John E. Bartmess
Quantity | Value | Units | Method | Reference | Comment |
---|---|---|---|---|---|
ΔfH°gas | -92.76 | kJ/mol | Ther | Kim, Wenthold, et al., 1998 | Vertical Detachment Energy: 2.189 eV. Affinity is EA difference with next lower +0.08 eV f |

Reaction thermochemistry data

Data compiled by: John E. Bartmess
Individual Reactions
HO- = HN2O2-
By formula: HO- = HN2O2-
Quantity | Value | Units | Method | Reference | Comment |
---|---|---|---|---|---|
ΔrH° | 35.6 | kJ/mol | N/A | Kim, Wenthold, et al., 1998 | gas phase; Vertical Detachment Energy: 2.189 eV. Affinity is EA difference with next lower +0.08 eV f |

Gas phase ion energetics data

Data compiled by: John E. Bartmess
Electron affinity of neutral species
EAneutral (eV) | Method | Reference | Comment |
---|---|---|---|
2.12 ± 0.10 | LPES | Kim, Wenthold, et al., 1998 | Vertical Detachment Energy: 2.189 eV. Affinity is EA difference with next lower +0.08 eV f |

Ion clustering data

Data compiled by: John E. Bartmess
Clustering reactions
HO- = HN2O2-
By formula: HO- = HN2O2-
Quantity | Value | Units | Method | Reference | Comment |
---|---|---|---|---|---|
ΔrH° | 35.6 | kJ/mol | N/A | Kim, Wenthold, et al., 1998 | gas phase; Vertical Detachment Energy: 2.189 eV. Affinity is EA difference with next lower +0.08 eV f |

References

Kim, Wenthold, et al., 1998
Kim, J.B.; Wenthold, P.G.; Lineberger, W.C.,
Photoelectron spectroscopy of OH-(N2O)(n=1-5),
J. Chem. Phys., 1998, 108, 3, 830-837, https://doi.org/10.1063/1.475447
. [all data]