Al9S anion

Gas phase ion energetics data

Data compiled by: John E. Bartmess

Electron affinity of neutral species

EAneutral (eV) Method Reference Comment
<1.94 ± 0.30LPESNakajima, Taguwa, et al., 1995Vertical Detachment Energy: 2.81±0.16 eV. EA is upper bound by ca. 0.1-0.3 eV

References

Nakajima, Taguwa, et al., 1995
Nakajima, A.; Taguwa, T.; Nakao, K.; Hoshino, K.; Iwata, S.; Kaya, K., Photoelectron Spectroscopy of AlnS1- Clusters (n=1-9), J. Chem. Phys., 1995, 102, 2, 660, https://doi.org/10.1063/1.469178 . [all data]