Al4S anion
- Formula: Al4S-
- Molecular weight: 139.992

Gas phase ion energetics data

Data compiled by: John E. Bartmess
Electron affinity of neutral species
EAneutral (eV) | Method | Reference | Comment |
---|---|---|---|
1.830 ± 0.060 | LPES | Nakajima, Taguwa, et al., 1995 | Vertical Detachment Energy: 1.96±0.08 eV |

References

Nakajima, Taguwa, et al., 1995
Nakajima, A.; Taguwa, T.; Nakao, K.; Hoshino, K.; Iwata, S.; Kaya, K.,
Photoelectron Spectroscopy of AlnS1- Clusters (n=1-9),
J. Chem. Phys., 1995, 102, 2, 660, https://doi.org/10.1063/1.469178
. [all data]