strontium anion
- Formula: Sr-
- Molecular weight: 87.62

Gas phase ion energetics data

Data compiled by: John E. Bartmess
Protonation reactions
Sr- + = HSr
Quantity | Value | Units | Method | Reference | Comment |
---|---|---|---|---|---|
ΔrH° | 1466.3 ± 3.7 | kJ/mol | D-EA | Andersen, Petrunin, et al., 1997 | gas phase |

Reaction thermochemistry data

Data compiled by: John E. Bartmess
Individual Reactions
Sr- + = HSr
Quantity | Value | Units | Method | Reference | Comment |
---|---|---|---|---|---|
ΔrH° | 350.46 ± 0.88 | kcal/mol | D-EA | Andersen, Petrunin, et al., 1997 | gas phase |

Gas phase thermochemistry data

Data compiled by: John E. Bartmess
Quantity | Value | Units | Method | Reference | Comment |
---|---|---|---|---|---|
ΔfH°gas | 37.2 ± 1.2 | kcal/mol | Acid | Andersen, Petrunin, et al., 1997 |

References

Andersen, Petrunin, et al., 1997
Andersen, H.H.; Petrunin, V.V.; Kristensen, P.; Andersen, T.,
Structural properties of the negative strontium ion: Binding energy and fine-structure splitting,
Phys. Rev. A, 1997, 55, 4, 3247-3249, https://doi.org/10.1103/PhysRevA.55.3247
. [all data]