In3P4 radical anion

Gas phase ion energetics data

Data compiled by: John E. Bartmess

Electron affinity of neutral species

EAneutral (eV) Method Reference Comment
2.720 ± 0.050LPESXu, Debeer, et al., 1994

References

Xu, Debeer, et al., 1994
Xu, C.S.; Debeer, E.; Arnold, D.W.; Arnold, C.C.; Neumark, D.M., Anion photoelectron spectroscopy of small indium phosphide clusters (InxPy(-);x,y=1-4), J. Chem. Phys., 1994, 101, 6, 5406, https://doi.org/10.1063/1.467393 . [all data]