InP2 radical anion

Gas phase ion energetics data

Data compiled by: John E. Bartmess

Electron affinity of neutral species

EAneutral (eV) Method Reference Comment
1.6170 ± 0.0010ZEKEArnold and Neumark, 1994
1.610 ± 0.050LPESXu, Debeer, et al., 1994

References

Arnold and Neumark, 1994
Arnold, C.C.; Neumark, D.M., Study of In2P/In2P- and InP2/InP2- using negative ion zero electron kinetic energy spectroscopy, Can. J. Phys., 1994, 72, 11-12, 1322, https://doi.org/10.1139/p94-168 . [all data]

Xu, Debeer, et al., 1994
Xu, C.S.; Debeer, E.; Arnold, D.W.; Arnold, C.C.; Neumark, D.M., Anion photoelectron spectroscopy of small indium phosphide clusters (InxPy(-);x,y=1-4), J. Chem. Phys., 1994, 101, 6, 5406, https://doi.org/10.1063/1.467393 . [all data]