H2O..O radical anion
- Formula: H2O2-
- Molecular weight: 34.0152

Gas phase thermochemistry data

Data compiled by: John E. Bartmess
Quantity | Value | Units | Method | Reference | Comment |
---|---|---|---|---|---|
ΔfH°gas | -135.7 | kJ/mol | Ther | Arnold, Xu, et al., 1995 | Vertical Detachment Energy: 1.45 eV. Affinity is difference between EA of O-. and HOH..O-. |

Ion clustering data

Data compiled by: John E. Bartmess
Clustering reactions
H2O2- + 2 = H4O3-
By formula: H2O2- + 2H2O = H4O3-
Quantity | Value | Units | Method | Reference | Comment |
---|---|---|---|---|---|
ΔrH° | 77.0 ± 7.5 | kJ/mol | LPES | Clements, Luong, et al., 2001 | gas phase |

Gas phase ion energetics data

Data compiled by: John E. Bartmess

Electron affinity of neutral species

EAneutral (eV) Method Reference Comment
2.607 ± 0.050LPESArnold, Xu, et al., 1995Vertical Detachment Energy: 1.45 eV. Affinity is difference between EA of O-. and HOH..O-.

References

Arnold, Xu, et al., 1995
Arnold, D.W.; Xu, C.S.; Neumark, D.M.,
Spectroscopy of the transition state: Elementary reactions of the hydroxyl radical studied by photoelectron spectroscopy of O-(H2O) and H3O2,
J. Chem. Phys., 1995, 102, 15, 6088, https://doi.org/10.1063/1.469343
. [all data]
Clements, Luong, et al., 2001
Clements, T.G.; Luong, A.K.; Deyerl, H.J.; Continetti, R.E.,
Dissociative photodetachment studies of O-(H2O)(2), OH- (H2O)(2), and the deuterated isotopomers: Energetics and three- body dissociation dynamics,
J. Chem. Phys., 2001, 114, 19, 8436-8444, https://doi.org/10.1063/1.1366332
. [all data]