PBrCl2 radical anion

Gas phase thermochemistry data

Data compiled by: John E. Bartmess

Quantity Value Units Method Reference Comment
Δfgas-385. ± 28.kJ/molR-EAMathur, Rothe, et al., 1976

References

Mathur, Rothe, et al., 1976
Mathur, B.P.; Rothe, E.W.; Tang, S.Y.; Reck, G., Negative ions from phosphorus halides due to cesium charge exchange, J. Chem. Phys., 1976, 64, 565. [all data]