Hexathiane anion
- Formula: S6-
- Molecular weight: 192.391

Gas phase thermochemistry data

Data compiled by: John E. Bartmess
Quantity | Value | Units | Method | Reference | Comment |
---|---|---|---|---|---|
ΔfH°gas | -49.8 ± 1.8 | kcal/mol | R-EA | Hunsicker, Jones, et al., 1995 | Vertical Detachment Energy: 3.55 eV. An isomer exists with EA=2.26 eV |

References

Hunsicker, Jones, et al., 1995
Hunsicker, S.; Jones, R.O.; Gantefor, G.,
Rings and chains in sulfur cluster anions S- to S-9(-): Theory (simulated annealing) and experiment (photoelectron detachment),
J. Chem. Phys., 1995, 102, 15, 5917, https://doi.org/10.1063/1.469326
. [all data]