N2O..I anion
- Formula: IN2O-
- Molecular weight: 170.9178

Gas phase thermochemistry data

Data compiled by: John E. Bartmess
Quantity | Value | Units | Method | Reference | Comment |
---|---|---|---|---|---|
ΔfH°gas | -118. ± 8.4 | kJ/mol | Ther | Arnold, Bradforth, et al., 1995 | EA given is Vertical Detachment Energy. Affinity: difference between successive EAs in (Y) |

Gas phase ion energetics data

Data compiled by: John E. Bartmess
Electron affinity of neutral species
EAneutral (eV) | Method | Reference | Comment |
---|---|---|---|
3.172 ± 0.035 | LPES | Arnold, Bradforth, et al., 1995 | EA given is Vertical Detachment Energy. Affinity: difference between successive EAs in (Y) |

References

Arnold, Bradforth, et al., 1995
Arnold, D.W.; Bradforth, S.E.; Kim, E.H.; Neumark, D.M.,
Study of I-(CO2)n, Br-(CO2)n, and I-(N2O)n clusters by anion photoelectron spectroscopy,
J. Chem. Phys., 1995, 102, 9, 3510, https://doi.org/10.1063/1.468576
. [all data]