mCH2Cl-benzoate anion
- Formula: C8H6ClO2-
- Molecular weight: 169.586

Gas phase ion energetics data

Data compiled by: John E. Bartmess
Electron affinity of neutral species
EAneutral (eV) | Method | Reference | Comment |
---|---|---|---|
3.89 ± 0.16 | D-EA | Decouzon, Exner, et al., 1994 |
Protonation reactions
By formula: C8H6ClO2- + H+ = C8H7ClO2
Quantity | Value | Units | Method | Reference | Comment |
---|---|---|---|---|---|
ΔrH° | 1409. ± 8.8 | kJ/mol | G+TS | Decouzon, Exner, et al., 1994 | gas phase |
Quantity | Value | Units | Method | Reference | Comment |
ΔrG° | 1380. ± 8.4 | kJ/mol | IMRE | Decouzon, Exner, et al., 1994 | gas phase |

References

Decouzon, Exner, et al., 1994
Decouzon, M.; Exner, O.; Gal, J.F.; Maria, P.C.,
The Meta versus Para substituent effect in the gas phase: Separation of inductive and resonance components,
J. Phys. Org. Chem., 1994, 7, 11, 615, https://doi.org/10.1002/poc.610071105
. [all data]