Et2SiH3 anion
- Formula: C4H13Si-
- Molecular weight: 89.2321

Gas phase thermochemistry data

Data compiled by: John E. Bartmess
Quantity | Value | Units | Method | Reference | Comment |
---|---|---|---|---|---|
ΔfH°gas | -38.9 | kJ/mol | Ther | Hajdasz, Ho, et al., 1994 | Hydride affinity order: Et3SiH≤Et2SiH2≤nPnSiH3≤SiH4. dHf(Et2SiH2) in 77Ped/Ryl is 10 kcal/mol too negative, relative to Me2SiH2.Group Additivity imples ca. -25 kcal/mol. |

References

Hajdasz, Ho, et al., 1994
Hajdasz, D.J.; Ho, Y.; Squires, R.R.,
Gas-Phase Chemistry of Pentacoordinate Silicon Hydrides,
J. Am. Chem. Soc., 1994, 116, 23, 10751, https://doi.org/10.1021/ja00102a045
. [all data]