Ru(CF3COCHCOMe)3 radical anion

Gas phase ion energetics data

Data compiled by: John E. Bartmess

Electron affinity of neutral species

EAneutral (eV) Method Reference Comment
2.775 ± 0.065IMRBSharpe, Eyler, et al., 1990EA given is actually -ΔGea(350 K)

References

Sharpe, Eyler, et al., 1990
Sharpe, P.; Eyler, J.R.; Richardson, D.E., Free Energies of Electron Attachment to Tris(acetylacetonate) and Tris(hexafluoroacetylacetonate) Transition-Metal Complexes in the Gas Phase: Experimental Results and Ligand Field Analysis, Inorg. Chem., 1990, 29, 15, 2779, https://doi.org/10.1021/ic00340a014 . [all data]