Phosphorus oxychloride anion
- Formula: Cl3OP-
- Molecular weight: 153.333

Gas phase thermochemistry data

Data compiled by: John E. Bartmess
Quantity | Value | Units | Method | Reference | Comment |
---|---|---|---|---|---|
ΔfH°gas | -705. ± 20. | kJ/mol | R-EA | Mathur, Rothe, et al., 1976 |

References

Mathur, Rothe, et al., 1976
Mathur, B.P.; Rothe, E.W.; Tang, S.Y.; Reck, G.,
Negative ions from phosphorus halides due to cesium charge exchange,
J. Chem. Phys., 1976, 64, 565. [all data]