Me3Sn anion
- Formula: C3H9Sn-
- Molecular weight: 163.814

Gas phase ion energetics data

Data compiled by: John E. Bartmess
Protonation reactions
C3H9Sn- + = C3H10Sn
By formula: C3H9Sn- + H+ = C3H10Sn
Quantity | Value | Units | Method | Reference | Comment |
---|---|---|---|---|---|
ΔrH° | 349.2 ± 2.1 | kcal/mol | G+TS | Brinkman, Salomon, et al., 1995 | gas phase; Acidity between MeCO2H and PhOH |
Quantity | Value | Units | Method | Reference | Comment |
ΔrG° | 341.9 ± 2.0 | kcal/mol | IMRB | Brinkman, Salomon, et al., 1995 | gas phase; Acidity between MeCO2H and PhOH |

Reaction thermochemistry data

Data compiled by: John E. Bartmess
Individual Reactions
C3H9Sn- + = C3H10Sn
By formula: C3H9Sn- + H+ = C3H10Sn
Quantity | Value | Units | Method | Reference | Comment |
---|---|---|---|---|---|
ΔrH° | 349.2 ± 2.1 | kcal/mol | G+TS | Brinkman, Salomon, et al., 1995 | gas phase; Acidity between MeCO2H and PhOH |
Quantity | Value | Units | Method | Reference | Comment |
ΔrG° | 341.9 ± 2.0 | kcal/mol | IMRB | Brinkman, Salomon, et al., 1995 | gas phase; Acidity between MeCO2H and PhOH |

References

Brinkman, Salomon, et al., 1995
Brinkman, E.A.; Salomon, K.; Tumas, W.; Brauman, J.I.,
Electron affinities and gas-phase acidities of organogermanium and organotin compounds,
J. Am. Chem. Soc., 1995, 117, 17, 4905, https://doi.org/10.1021/ja00122a022
. [all data]